Problema installazione moduli VMware

Problemi e suggerimenti legati al software e ai pacchetti problematici.
Rispondi
JacopoMolteni
Arciere
Messaggi: 226
Iscritto il: 11 febbraio 2015, 16:53
Architettura: x86_64 (64bit)

Problema installazione moduli VMware

Messaggio da JacopoMolteni » 24 marzo 2015, 18:50

Sto provando ad installare Vmware sulla mia Arch, il problema è che al momento dell'installazione dei moduli ottengo questo output:

Codice: Seleziona tutto

/tmp/vmware-root/modules/vmmon-only/./include/vm_assert.h:274:20: warning: typedef ‘AssertOnCompileFailed’ locally defined but not used [-Wunused-local-typedefs]
       typedef char AssertOnCompileFailed[AssertOnCompileMisused]; \
                    ^
/tmp/vmware-root/modules/vmmon-only/./include/x86svm.h:317:4: note: in expansion of macro ‘ASSERT_ON_COMPILE’
    ASSERT_ON_COMPILE(SVM_EXEC_CTL_BIT(SVM_EXITCODE_##name) == \
    ^
/tmp/vmware-root/modules/vmmon-only/./include/x86svm.h:349:4: note: in expansion of macro ‘VERIFY_EXEC_CTL’
    VERIFY_EXEC_CTL(INVLPGA);
    ^
/tmp/vmware-root/modules/vmmon-only/./include/vm_assert.h:274:20: warning: typedef ‘AssertOnCompileFailed’ locally defined but not used [-Wunused-local-typedefs]
       typedef char AssertOnCompileFailed[AssertOnCompileMisused]; \
                    ^
/tmp/vmware-root/modules/vmmon-only/./include/x86svm.h:317:4: note: in expansion of macro ‘ASSERT_ON_COMPILE’
    ASSERT_ON_COMPILE(SVM_EXEC_CTL_BIT(SVM_EXITCODE_##name) == \
    ^
/tmp/vmware-root/modules/vmmon-only/./include/x86svm.h:350:4: note: in expansion of macro ‘VERIFY_EXEC_CTL’
    VERIFY_EXEC_CTL(IOIO);
    ^
/tmp/vmware-root/modules/vmmon-only/./include/vm_assert.h:274:20: warning: typedef ‘AssertOnCompileFailed’ locally defined but not used [-Wunused-local-typedefs]
       typedef char AssertOnCompileFailed[AssertOnCompileMisused]; \
                    ^
/tmp/vmware-root/modules/vmmon-only/./include/x86svm.h:317:4: note: in expansion of macro ‘ASSERT_ON_COMPILE’
    ASSERT_ON_COMPILE(SVM_EXEC_CTL_BIT(SVM_EXITCODE_##name) == \
    ^
/tmp/vmware-root/modules/vmmon-only/./include/x86svm.h:351:4: note: in expansion of macro ‘VERIFY_EXEC_CTL’
    VERIFY_EXEC_CTL(MSR);
    ^
/tmp/vmware-root/modules/vmmon-only/./include/vm_assert.h:274:20: warning: typedef ‘AssertOnCompileFailed’ locally defined but not used [-Wunused-local-typedefs]
       typedef char AssertOnCompileFailed[AssertOnCompileMisused]; \
                    ^
/tmp/vmware-root/modules/vmmon-only/./include/x86svm.h:317:4: note: in expansion of macro ‘ASSERT_ON_COMPILE’
    ASSERT_ON_COMPILE(SVM_EXEC_CTL_BIT(SVM_EXITCODE_##name) == \
    ^
/tmp/vmware-root/modules/vmmon-only/./include/x86svm.h:352:4: note: in expansion of macro ‘VERIFY_EXEC_CTL’
    VERIFY_EXEC_CTL(TS);
    ^
/tmp/vmware-root/modules/vmmon-only/./include/vm_assert.h:274:20: warning: typedef ‘AssertOnCompileFailed’ locally defined but not used [-Wunused-local-typedefs]
       typedef char AssertOnCompileFailed[AssertOnCompileMisused]; \
                    ^
/tmp/vmware-root/modules/vmmon-only/./include/x86svm.h:317:4: note: in expansion of macro ‘ASSERT_ON_COMPILE’
    ASSERT_ON_COMPILE(SVM_EXEC_CTL_BIT(SVM_EXITCODE_##name) == \
    ^
/tmp/vmware-root/modules/vmmon-only/./include/x86svm.h:353:4: note: in expansion of macro ‘VERIFY_EXEC_CTL’
    VERIFY_EXEC_CTL(FERR_FRZ);
    ^
/tmp/vmware-root/modules/vmmon-only/./include/vm_assert.h:274:20: warning: typedef ‘AssertOnCompileFailed’ locally defined but not used [-Wunused-local-typedefs]
       typedef char AssertOnCompileFailed[AssertOnCompileMisused]; \
                    ^
/tmp/vmware-root/modules/vmmon-only/./include/x86svm.h:317:4: note: in expansion of macro ‘ASSERT_ON_COMPILE’
    ASSERT_ON_COMPILE(SVM_EXEC_CTL_BIT(SVM_EXITCODE_##name) == \
    ^
/tmp/vmware-root/modules/vmmon-only/./include/x86svm.h:354:4: note: in expansion of macro ‘VERIFY_EXEC_CTL’
    VERIFY_EXEC_CTL(SHUTDOWN);
    ^
/tmp/vmware-root/modules/vmmon-only/./include/vm_assert.h:274:20: warning: typedef ‘AssertOnCompileFailed’ locally defined but not used [-Wunused-local-typedefs]
       typedef char AssertOnCompileFailed[AssertOnCompileMisused]; \
                    ^
/tmp/vmware-root/modules/vmmon-only/./include/x86svm.h:317:4: note: in expansion of macro ‘ASSERT_ON_COMPILE’
    ASSERT_ON_COMPILE(SVM_EXEC_CTL_BIT(SVM_EXITCODE_##name) == \
    ^
/tmp/vmware-root/modules/vmmon-only/./include/x86svm.h:355:4: note: in expansion of macro ‘VERIFY_EXEC_CTL’
    VERIFY_EXEC_CTL(VMRUN);
    ^
/tmp/vmware-root/modules/vmmon-only/./include/vm_assert.h:274:20: warning: typedef ‘AssertOnCompileFailed’ locally defined but not used [-Wunused-local-typedefs]
       typedef char AssertOnCompileFailed[AssertOnCompileMisused]; \
                    ^
/tmp/vmware-root/modules/vmmon-only/./include/x86svm.h:317:4: note: in expansion of macro ‘ASSERT_ON_COMPILE’
    ASSERT_ON_COMPILE(SVM_EXEC_CTL_BIT(SVM_EXITCODE_##name) == \
    ^
/tmp/vmware-root/modules/vmmon-only/./include/x86svm.h:356:4: note: in expansion of macro ‘VERIFY_EXEC_CTL’
    VERIFY_EXEC_CTL(VMMCALL);
    ^
/tmp/vmware-root/modules/vmmon-only/./include/vm_assert.h:274:20: warning: typedef ‘AssertOnCompileFailed’ locally defined but not used [-Wunused-local-typedefs]
       typedef char AssertOnCompileFailed[AssertOnCompileMisused]; \
                    ^
/tmp/vmware-root/modules/vmmon-only/./include/x86svm.h:317:4: note: in expansion of macro ‘ASSERT_ON_COMPILE’
    ASSERT_ON_COMPILE(SVM_EXEC_CTL_BIT(SVM_EXITCODE_##name) == \
    ^
/tmp/vmware-root/modules/vmmon-only/./include/x86svm.h:357:4: note: in expansion of macro ‘VERIFY_EXEC_CTL’
    VERIFY_EXEC_CTL(VMLOAD);
    ^
/tmp/vmware-root/modules/vmmon-only/./include/vm_assert.h:274:20: warning: typedef ‘AssertOnCompileFailed’ locally defined but not used [-Wunused-local-typedefs]
       typedef char AssertOnCompileFailed[AssertOnCompileMisused]; \
                    ^
/tmp/vmware-root/modules/vmmon-only/./include/x86svm.h:317:4: note: in expansion of macro ‘ASSERT_ON_COMPILE’
    ASSERT_ON_COMPILE(SVM_EXEC_CTL_BIT(SVM_EXITCODE_##name) == \
    ^
/tmp/vmware-root/modules/vmmon-only/./include/x86svm.h:358:4: note: in expansion of macro ‘VERIFY_EXEC_CTL’
    VERIFY_EXEC_CTL(VMSAVE);
    ^
/tmp/vmware-root/modules/vmmon-only/./include/vm_assert.h:274:20: warning: typedef ‘AssertOnCompileFailed’ locally defined but not used [-Wunused-local-typedefs]
       typedef char AssertOnCompileFailed[AssertOnCompileMisused]; \
                    ^
/tmp/vmware-root/modules/vmmon-only/./include/x86svm.h:317:4: note: in expansion of macro ‘ASSERT_ON_COMPILE’
    ASSERT_ON_COMPILE(SVM_EXEC_CTL_BIT(SVM_EXITCODE_##name) == \
    ^
/tmp/vmware-root/modules/vmmon-only/./include/x86svm.h:359:4: note: in expansion of macro ‘VERIFY_EXEC_CTL’
    VERIFY_EXEC_CTL(STGI);
    ^
/tmp/vmware-root/modules/vmmon-only/./include/vm_assert.h:274:20: warning: typedef ‘AssertOnCompileFailed’ locally defined but not used [-Wunused-local-typedefs]
       typedef char AssertOnCompileFailed[AssertOnCompileMisused]; \
                    ^
/tmp/vmware-root/modules/vmmon-only/./include/x86svm.h:317:4: note: in expansion of macro ‘ASSERT_ON_COMPILE’
    ASSERT_ON_COMPILE(SVM_EXEC_CTL_BIT(SVM_EXITCODE_##name) == \
    ^
/tmp/vmware-root/modules/vmmon-only/./include/x86svm.h:360:4: note: in expansion of macro ‘VERIFY_EXEC_CTL’
    VERIFY_EXEC_CTL(CLGI);
    ^
/tmp/vmware-root/modules/vmmon-only/./include/vm_assert.h:274:20: warning: typedef ‘AssertOnCompileFailed’ locally defined but not used [-Wunused-local-typedefs]
       typedef char AssertOnCompileFailed[AssertOnCompileMisused]; \
                    ^
/tmp/vmware-root/modules/vmmon-only/./include/x86svm.h:317:4: note: in expansion of macro ‘ASSERT_ON_COMPILE’
    ASSERT_ON_COMPILE(SVM_EXEC_CTL_BIT(SVM_EXITCODE_##name) == \
    ^
/tmp/vmware-root/modules/vmmon-only/./include/x86svm.h:361:4: note: in expansion of macro ‘VERIFY_EXEC_CTL’
    VERIFY_EXEC_CTL(SKINIT);
    ^
/tmp/vmware-root/modules/vmmon-only/./include/vm_assert.h:274:20: warning: typedef ‘AssertOnCompileFailed’ locally defined but not used [-Wunused-local-typedefs]
       typedef char AssertOnCompileFailed[AssertOnCompileMisused]; \
                    ^
/tmp/vmware-root/modules/vmmon-only/./include/x86svm.h:317:4: note: in expansion of macro ‘ASSERT_ON_COMPILE’
    ASSERT_ON_COMPILE(SVM_EXEC_CTL_BIT(SVM_EXITCODE_##name) == \
    ^
/tmp/vmware-root/modules/vmmon-only/./include/x86svm.h:362:4: note: in expansion of macro ‘VERIFY_EXEC_CTL’
    VERIFY_EXEC_CTL(RDTSCP);
    ^
/tmp/vmware-root/modules/vmmon-only/./include/vm_assert.h:274:20: warning: typedef ‘AssertOnCompileFailed’ locally defined but not used [-Wunused-local-typedefs]
       typedef char AssertOnCompileFailed[AssertOnCompileMisused]; \
                    ^
/tmp/vmware-root/modules/vmmon-only/./include/x86svm.h:317:4: note: in expansion of macro ‘ASSERT_ON_COMPILE’
    ASSERT_ON_COMPILE(SVM_EXEC_CTL_BIT(SVM_EXITCODE_##name) == \
    ^
/tmp/vmware-root/modules/vmmon-only/./include/x86svm.h:363:4: note: in expansion of macro ‘VERIFY_EXEC_CTL’
    VERIFY_EXEC_CTL(ICEBP);
    ^
/tmp/vmware-root/modules/vmmon-only/./include/vm_assert.h:274:20: warning: typedef ‘AssertOnCompileFailed’ locally defined but not used [-Wunused-local-typedefs]
       typedef char AssertOnCompileFailed[AssertOnCompileMisused]; \
                    ^
/tmp/vmware-root/modules/vmmon-only/./include/x86svm.h:317:4: note: in expansion of macro ‘ASSERT_ON_COMPILE’
    ASSERT_ON_COMPILE(SVM_EXEC_CTL_BIT(SVM_EXITCODE_##name) == \
    ^
/tmp/vmware-root/modules/vmmon-only/./include/x86svm.h:364:4: note: in expansion of macro ‘VERIFY_EXEC_CTL’
    VERIFY_EXEC_CTL(WBINVD);
    ^
/tmp/vmware-root/modules/vmmon-only/./include/vm_assert.h:274:20: warning: typedef ‘AssertOnCompileFailed’ locally defined but not used [-Wunused-local-typedefs]
       typedef char AssertOnCompileFailed[AssertOnCompileMisused]; \
                    ^
/tmp/vmware-root/modules/vmmon-only/./include/x86svm.h:317:4: note: in expansion of macro ‘ASSERT_ON_COMPILE’
    ASSERT_ON_COMPILE(SVM_EXEC_CTL_BIT(SVM_EXITCODE_##name) == \
    ^
/tmp/vmware-root/modules/vmmon-only/./include/x86svm.h:365:4: note: in expansion of macro ‘VERIFY_EXEC_CTL’
    VERIFY_EXEC_CTL(MONITOR);
    ^
/tmp/vmware-root/modules/vmmon-only/./include/vm_assert.h:274:20: warning: typedef ‘AssertOnCompileFailed’ locally defined but not used [-Wunused-local-typedefs]
       typedef char AssertOnCompileFailed[AssertOnCompileMisused]; \
                    ^
/tmp/vmware-root/modules/vmmon-only/./include/x86svm.h:317:4: note: in expansion of macro ‘ASSERT_ON_COMPILE’
    ASSERT_ON_COMPILE(SVM_EXEC_CTL_BIT(SVM_EXITCODE_##name) == \
    ^
/tmp/vmware-root/modules/vmmon-only/./include/x86svm.h:366:4: note: in expansion of macro ‘VERIFY_EXEC_CTL’
    VERIFY_EXEC_CTL(MWAIT);
    ^
/tmp/vmware-root/modules/vmmon-only/./include/vm_assert.h:274:20: warning: typedef ‘AssertOnCompileFailed’ locally defined but not used [-Wunused-local-typedefs]
       typedef char AssertOnCompileFailed[AssertOnCompileMisused]; \
                    ^
/tmp/vmware-root/modules/vmmon-only/./include/x86svm.h:317:4: note: in expansion of macro ‘ASSERT_ON_COMPILE’
    ASSERT_ON_COMPILE(SVM_EXEC_CTL_BIT(SVM_EXITCODE_##name) == \
    ^
/tmp/vmware-root/modules/vmmon-only/./include/x86svm.h:367:4: note: in expansion of macro ‘VERIFY_EXEC_CTL’
    VERIFY_EXEC_CTL(MWAIT_COND);
    ^
/tmp/vmware-root/modules/vmmon-only/./include/vm_assert.h:274:20: warning: typedef ‘AssertOnCompileFailed’ locally defined but not used [-Wunused-local-typedefs]
       typedef char AssertOnCompileFailed[AssertOnCompileMisused]; \
                    ^
/tmp/vmware-root/modules/vmmon-only/./include/vm_assert.h:296:7: note: in definition of macro ‘MY_ASSERTS’
       assertions \
       ^
/tmp/vmware-root/modules/vmmon-only/./include/pshare_ext.h:60:12: note: in expansion of macro ‘ASSERT_ON_COMPILE’
            ASSERT_ON_COMPILE(PSHARE_HINT_UPDATES_MAX <= PSHARE_PAGELIST_MAX &&
            ^
/tmp/vmware-root/modules/vmmon-only/./include/monitorAction_exported.h: In function ‘MonitorActionSet_AtomicInclude’:
/tmp/vmware-root/modules/vmmon-only/./include/vm_assert.h:274:20: warning: typedef ‘AssertOnCompileFailed’ locally defined but not used [-Wunused-local-typedefs]
       typedef char AssertOnCompileFailed[AssertOnCompileMisused]; \
                    ^
/tmp/vmware-root/modules/vmmon-only/./include/monitorAction_exported.h:91:4: note: in expansion of macro ‘ASSERT_ON_COMPILE’
    ASSERT_ON_COMPILE((ACTION_WORD_SIZE & (ACTION_WORD_SIZE - 1)) == 0);
    ^
/tmp/vmware-root/modules/vmmon-only/./include/iocontrols.h: In function ‘VA64ToPtr’:
/tmp/vmware-root/modules/vmmon-only/./include/vm_assert.h:274:20: warning: typedef ‘AssertOnCompileFailed’ locally defined but not used [-Wunused-local-typedefs]
       typedef char AssertOnCompileFailed[AssertOnCompileMisused]; \
                    ^
/tmp/vmware-root/modules/vmmon-only/./include/iocontrols.h:76:4: note: in expansion of macro ‘ASSERT_ON_COMPILE’
    ASSERT_ON_COMPILE(sizeof (void *) == 8);
    ^
/tmp/vmware-root/modules/vmmon-only/./include/iocontrols.h: In function ‘PtrToVA64’:
/tmp/vmware-root/modules/vmmon-only/./include/vm_assert.h:274:20: warning: typedef ‘AssertOnCompileFailed’ locally defined but not used [-Wunused-local-typedefs]
       typedef char AssertOnCompileFailed[AssertOnCompileMisused]; \
                    ^
/tmp/vmware-root/modules/vmmon-only/./include/iocontrols.h:114:4: note: in expansion of macro ‘ASSERT_ON_COMPILE’
    ASSERT_ON_COMPILE(sizeof ptr <= sizeof (VA64));
    ^
In file included from /tmp/vmware-root/modules/vmmon-only/./include/rateconv.h:45:0,
                 from /tmp/vmware-root/modules/vmmon-only/./include/ptsc.h:35,
                 from /tmp/vmware-root/modules/vmmon-only/./include/modulecall.h:35,
                 from /tmp/vmware-root/modules/vmmon-only/linux/hostif.c:85:
/tmp/vmware-root/modules/vmmon-only/./include/vm_atomic.h: In function ‘AtomicAssertOnCompilePtr’:
/tmp/vmware-root/modules/vmmon-only/./include/vm_atomic.h:2241:20: warning: typedef ‘AssertOnCompileFailed’ locally defined but not used [-Wunused-local-typedefs]
       typedef char AssertOnCompileFailed[AssertOnCompileMisused];             \
                    ^
/tmp/vmware-root/modules/vmmon-only/./include/vm_atomic.h:2402:1: note: in expansion of macro ‘MAKE_ATOMIC_TYPE’
 MAKE_ATOMIC_TYPE(Ptr, 64, void const *, void *, uintptr_t)
 ^
/tmp/vmware-root/modules/vmmon-only/./include/vm_atomic.h: In function ‘AtomicAssertOnCompileInt’:
/tmp/vmware-root/modules/vmmon-only/./include/vm_atomic.h:2241:20: warning: typedef ‘AssertOnCompileFailed’ locally defined but not used [-Wunused-local-typedefs]
       typedef char AssertOnCompileFailed[AssertOnCompileMisused];             \
                    ^
/tmp/vmware-root/modules/vmmon-only/./include/vm_atomic.h:2406:1: note: in expansion of macro ‘MAKE_ATOMIC_TYPE’
 MAKE_ATOMIC_TYPE(Int, 32, int, int, int)
 ^
In file included from /tmp/vmware-root/modules/vmmon-only/./include/vmware.h:39:0,
                 from /tmp/vmware-root/modules/vmmon-only/linux/hostif.c:82:
/tmp/vmware-root/modules/vmmon-only/./include/vcpuset.h: In function ‘VCPUSet_Singleton’:
/tmp/vmware-root/modules/vmmon-only/./include/vm_assert.h:274:20: warning: typedef ‘AssertOnCompileFailed’ locally defined but not used [-Wunused-local-typedefs]
       typedef char AssertOnCompileFailed[AssertOnCompileMisused]; \
                    ^
/tmp/vmware-root/modules/vmmon-only/./include/vcpuset.h:65:4: note: in expansion of macro ‘ASSERT_ON_COMPILE’
    ASSERT_ON_COMPILE(VCPUID_INVALID >= 64); // Ensure test below catches invalid VCPUs
    ^
/tmp/vmware-root/modules/vmmon-only/./include/pagelist.h: In function ‘PAGELISTDEFS’:
/tmp/vmware-root/modules/vmmon-only/./include/vm_assert.h:274:20: warning: typedef ‘AssertOnCompileFailed’ locally defined but not used [-Wunused-local-typedefs]
       typedef char AssertOnCompileFailed[AssertOnCompileMisused]; \
                    ^
/tmp/vmware-root/modules/vmmon-only/./include/vm_assert.h:296:7: note: in definition of macro ‘MY_ASSERTS’
       assertions \
       ^
/tmp/vmware-root/modules/vmmon-only/./include/pagelist.h:62:12: note: in expansion of macro ‘ASSERT_ON_COMPILE’
            ASSERT_ON_COMPILE(sizeof(PageList) <= PAGE_SIZE);)
            ^
/tmp/vmware-root/modules/vmmon-only/./include/pshare_ext.h: In function ‘PSHARE_EXT’:
/tmp/vmware-root/modules/vmmon-only/./include/vm_assert.h:274:20: warning: typedef ‘AssertOnCompileFailed’ locally defined but not used [-Wunused-local-typedefs]
       typedef char AssertOnCompileFailed[AssertOnCompileMisused]; \
                    ^
/tmp/vmware-root/modules/vmmon-only/./include/vm_assert.h:296:7: note: in definition of macro ‘MY_ASSERTS’
       assertions \
       ^
/tmp/vmware-root/modules/vmmon-only/./include/pshare_ext.h:60:12: note: in expansion of macro ‘ASSERT_ON_COMPILE’
            ASSERT_ON_COMPILE(PSHARE_HINT_UPDATES_MAX <= PSHARE_PAGELIST_MAX &&
            ^
/tmp/vmware-root/modules/vmmon-only/./include/monitorAction_exported.h: In function ‘MonitorActionSet_AtomicInclude’:
/tmp/vmware-root/modules/vmmon-only/./include/vm_assert.h:274:20: warning: typedef ‘AssertOnCompileFailed’ locally defined but not used [-Wunused-local-typedefs]
       typedef char AssertOnCompileFailed[AssertOnCompileMisused]; \
                    ^
/tmp/vmware-root/modules/vmmon-only/./include/monitorAction_exported.h:91:4: note: in expansion of macro ‘ASSERT_ON_COMPILE’
    ASSERT_ON_COMPILE((ACTION_WORD_SIZE & (ACTION_WORD_SIZE - 1)) == 0);
    ^
/tmp/vmware-root/modules/vmmon-only/./include/iocontrols.h: In function ‘VA64ToPtr’:
/tmp/vmware-root/modules/vmmon-only/./include/vm_assert.h:274:20: warning: typedef ‘AssertOnCompileFailed’ locally defined but not used [-Wunused-local-typedefs]
       typedef char AssertOnCompileFailed[AssertOnCompileMisused]; \
                    ^
/tmp/vmware-root/modules/vmmon-only/./include/iocontrols.h:76:4: note: in expansion of macro ‘ASSERT_ON_COMPILE’
    ASSERT_ON_COMPILE(sizeof (void *) == 8);
    ^
/tmp/vmware-root/modules/vmmon-only/./include/iocontrols.h: In function ‘PtrToVA64’:
/tmp/vmware-root/modules/vmmon-only/./include/vm_assert.h:274:20: warning: typedef ‘AssertOnCompileFailed’ locally defined but not used [-Wunused-local-typedefs]
       typedef char AssertOnCompileFailed[AssertOnCompileMisused]; \
                    ^
/tmp/vmware-root/modules/vmmon-only/./include/iocontrols.h:114:4: note: in expansion of macro ‘ASSERT_ON_COMPILE’
    ASSERT_ON_COMPILE(sizeof ptr <= sizeof (VA64));
    ^
/tmp/vmware-root/modules/vmmon-only/linux/hostif.c: In function ‘SetVMAPICAddr’:
/tmp/vmware-root/modules/vmmon-only/./include/vm_assert.h:274:20: warning: typedef ‘AssertOnCompileFailed’ locally defined but not used [-Wunused-local-typedefs]
       typedef char AssertOnCompileFailed[AssertOnCompileMisused]; \
                    ^
/tmp/vmware-root/modules/vmmon-only/linux/hostif.c:2301:4: note: in expansion of macro ‘ASSERT_ON_COMPILE’
    ASSERT_ON_COMPILE(APICR_SIZE <= PAGE_SIZE);
    ^
  LD [M]  /tmp/vmware-root/modules/vmmon-only/vmmon.o
  Building modules, stage 2.
  MODPOST 1 modules
  CC      /tmp/vmware-root/modules/vmmon-only/vmmon.mod.o
  LD [M]  /tmp/vmware-root/modules/vmmon-only/vmmon.ko
make[1]: uscita dalla directory "/usr/lib/modules/3.19.2-1-ARCH/build"
make -C $PWD SRCROOT=$PWD/. \
  MODULEBUILDDIR= postbuild
make[1]: ingresso nella directory "/tmp/vmware-root/modules/vmmon-only"
make[1]: "postbuild" è aggiornato.
make[1]: uscita dalla directory "/tmp/vmware-root/modules/vmmon-only"
cp -f vmmon.ko ./../vmmon.o
make: uscita dalla directory "/tmp/vmware-root/modules/vmmon-only"
Built vmmon module
make: ingresso nella directory "/tmp/vmware-root/modules/vmnet-only"
Using 2.6.x kernel build system.
make -C /lib/modules/3.19.2-1-ARCH/build/include/.. SUBDIRS=$PWD SRCROOT=$PWD/. \
  MODULEBUILDDIR= modules
make[1]: ingresso nella directory "/usr/lib/modules/3.19.2-1-ARCH/build"
  CC [M]  /tmp/vmware-root/modules/vmnet-only/driver.o
  CC [M]  /tmp/vmware-root/modules/vmnet-only/hub.o
  CC [M]  /tmp/vmware-root/modules/vmnet-only/netif.o
  CC [M]  /tmp/vmware-root/modules/vmnet-only/filter.o
  CC [M]  /tmp/vmware-root/modules/vmnet-only/userif.o
  CC [M]  /tmp/vmware-root/modules/vmnet-only/bridge.o
  CC [M]  /tmp/vmware-root/modules/vmnet-only/smac_compat.o
  CC [M]  /tmp/vmware-root/modules/vmnet-only/procfs.o
  CC [M]  /tmp/vmware-root/modules/vmnet-only/smac.o
  CC [M]  /tmp/vmware-root/modules/vmnet-only/vnetEvent.o
  CC [M]  /tmp/vmware-root/modules/vmnet-only/vnetUserListener.o
In file included from /tmp/vmware-root/modules/vmnet-only/vnet.h:28:0,
                 from /tmp/vmware-root/modules/vmnet-only/vnetEvent.h:27,
                 from /tmp/vmware-root/modules/vmnet-only/vnetEvent.c:57:
/tmp/vmware-root/modules/vmnet-only/vm_atomic.h: In function ‘AtomicAssertOnCompilePtr’:
/tmp/vmware-root/modules/vmnet-only/vm_atomic.h:2241:20: warning: typedef ‘AssertOnCompileFailed’ locally defined but not used [-Wunused-local-typedefs]
       typedef char AssertOnCompileFailed[AssertOnCompileMisused];             \
                    ^
/tmp/vmware-root/modules/vmnet-only/vm_atomic.h:2402:1: note: in expansion of macro ‘MAKE_ATOMIC_TYPE’
 MAKE_ATOMIC_TYPE(Ptr, 64, void const *, void *, uintptr_t)
 ^
/tmp/vmware-root/modules/vmnet-only/vm_atomic.h: In function ‘AtomicAssertOnCompileInt’:
/tmp/vmware-root/modules/vmnet-only/vm_atomic.h:2241:20: warning: typedef ‘AssertOnCompileFailed’ locally defined but not used [-Wunused-local-typedefs]
       typedef char AssertOnCompileFailed[AssertOnCompileMisused];             \
                    ^
/tmp/vmware-root/modules/vmnet-only/vm_atomic.h:2406:1: note: in expansion of macro ‘MAKE_ATOMIC_TYPE’
 MAKE_ATOMIC_TYPE(Int, 32, int, int, int)
 ^
In file included from /tmp/vmware-root/modules/vmnet-only/monitorAction_exported.h:31:0,
                 from /tmp/vmware-root/modules/vmnet-only/vnet.h:29,
                 from /tmp/vmware-root/modules/vmnet-only/vnetEvent.h:27,
                 from /tmp/vmware-root/modules/vmnet-only/vnetEvent.c:57:
/tmp/vmware-root/modules/vmnet-only/monitorAction_exported.h: In function ‘MonitorActionSet_AtomicInclude’:
/tmp/vmware-root/modules/vmnet-only/vm_assert.h:274:20: warning: typedef ‘AssertOnCompileFailed’ locally defined but not used [-Wunused-local-typedefs]
       typedef char AssertOnCompileFailed[AssertOnCompileMisused]; \
                    ^
/tmp/vmware-root/modules/vmnet-only/monitorAction_exported.h:91:4: note: in expansion of macro ‘ASSERT_ON_COMPILE’
    ASSERT_ON_COMPILE((ACTION_WORD_SIZE & (ACTION_WORD_SIZE - 1)) == 0);
    ^
In file included from /tmp/vmware-root/modules/vmnet-only/vnet.h:28:0,
                 from /tmp/vmware-root/modules/vmnet-only/vnetInt.h:24,
                 from /tmp/vmware-root/modules/vmnet-only/smac_compat.c:53:
/tmp/vmware-root/modules/vmnet-only/vm_atomic.h: In function ‘AtomicAssertOnCompilePtr’:
/tmp/vmware-root/modules/vmnet-only/vm_atomic.h:2241:20: warning: typedef ‘AssertOnCompileFailed’ locally defined but not used [-Wunused-local-typedefs]
       typedef char AssertOnCompileFailed[AssertOnCompileMisused];             \
                    ^
/tmp/vmware-root/modules/vmnet-only/vm_atomic.h:2402:1: note: in expansion of macro ‘MAKE_ATOMIC_TYPE’
 MAKE_ATOMIC_TYPE(Ptr, 64, void const *, void *, uintptr_t)
 ^
/tmp/vmware-root/modules/vmnet-only/vm_atomic.h: In function ‘AtomicAssertOnCompileInt’:
/tmp/vmware-root/modules/vmnet-only/vm_atomic.h:2241:20: warning: typedef ‘AssertOnCompileFailed’ locally defined but not used [-Wunused-local-typedefs]
       typedef char AssertOnCompileFailed[AssertOnCompileMisused];             \
                    ^
/tmp/vmware-root/modules/vmnet-only/vm_atomic.h:2406:1: note: in expansion of macro ‘MAKE_ATOMIC_TYPE’
 MAKE_ATOMIC_TYPE(Int, 32, int, int, int)
 ^
In file included from /tmp/vmware-root/modules/vmnet-only/monitorAction_exported.h:31:0,
                 from /tmp/vmware-root/modules/vmnet-only/vnet.h:29,
                 from /tmp/vmware-root/modules/vmnet-only/vnetInt.h:24,
                 from /tmp/vmware-root/modules/vmnet-only/smac_compat.c:53:
/tmp/vmware-root/modules/vmnet-only/monitorAction_exported.h: In function ‘MonitorActionSet_AtomicInclude’:
/tmp/vmware-root/modules/vmnet-only/vm_assert.h:274:20: warning: typedef ‘AssertOnCompileFailed’ locally defined but not used [-Wunused-local-typedefs]
       typedef char AssertOnCompileFailed[AssertOnCompileMisused]; \
                    ^
/tmp/vmware-root/modules/vmnet-only/monitorAction_exported.h:91:4: note: in expansion of macro ‘ASSERT_ON_COMPILE’
    ASSERT_ON_COMPILE((ACTION_WORD_SIZE & (ACTION_WORD_SIZE - 1)) == 0);
    ^
In file included from /tmp/vmware-root/modules/vmnet-only/vnet.h:28:0,
                 from /tmp/vmware-root/modules/vmnet-only/vnetInt.h:24,
                 from /tmp/vmware-root/modules/vmnet-only/filter.c:48:
/tmp/vmware-root/modules/vmnet-only/vm_atomic.h: In function ‘AtomicAssertOnCompilePtr’:
/tmp/vmware-root/modules/vmnet-only/vm_atomic.h:2241:20: warning: typedef ‘AssertOnCompileFailed’ locally defined but not used [-Wunused-local-typedefs]
       typedef char AssertOnCompileFailed[AssertOnCompileMisused];             \
                    ^
/tmp/vmware-root/modules/vmnet-only/vm_atomic.h:2402:1: note: in expansion of macro ‘MAKE_ATOMIC_TYPE’
 MAKE_ATOMIC_TYPE(Ptr, 64, void const *, void *, uintptr_t)
 ^
/tmp/vmware-root/modules/vmnet-only/vm_atomic.h: In function ‘AtomicAssertOnCompileInt’:
/tmp/vmware-root/modules/vmnet-only/vm_atomic.h:2241:20: warning: typedef ‘AssertOnCompileFailed’ locally defined but not used [-Wunused-local-typedefs]
       typedef char AssertOnCompileFailed[AssertOnCompileMisused];             \
                    ^
/tmp/vmware-root/modules/vmnet-only/vm_atomic.h:2406:1: note: in expansion of macro ‘MAKE_ATOMIC_TYPE’
 MAKE_ATOMIC_TYPE(Int, 32, int, int, int)
 ^
In file included from /tmp/vmware-root/modules/vmnet-only/monitorAction_exported.h:31:0,
                 from /tmp/vmware-root/modules/vmnet-only/vnet.h:29,
                 from /tmp/vmware-root/modules/vmnet-only/vnetInt.h:24,
                 from /tmp/vmware-root/modules/vmnet-only/filter.c:48:
/tmp/vmware-root/modules/vmnet-only/monitorAction_exported.h: In function ‘MonitorActionSet_AtomicInclude’:
In file included from /tmp/vmware-root/modules/vmnet-only/vnet.h:28:0,
                 from /tmp/vmware-root/modules/vmnet-only/vnetInt.h:24,
                 from /tmp/vmware-root/modules/vmnet-only/hub.c:43:
/tmp/vmware-root/modules/vmnet-only/vm_atomic.h: In function ‘AtomicAssertOnCompilePtr’:
/tmp/vmware-root/modules/vmnet-only/vm_assert.h:274:20: warning: typedef ‘AssertOnCompileFailed’ locally defined but not used [-Wunused-local-typedefs]
       typedef char AssertOnCompileFailed[AssertOnCompileMisused]; \
                    ^
/tmp/vmware-root/modules/vmnet-only/monitorAction_exported.h:91:4: note: in expansion of macro ‘ASSERT_ON_COMPILE’
    ASSERT_ON_COMPILE((ACTION_WORD_SIZE & (ACTION_WORD_SIZE - 1)) == 0);
    ^
/tmp/vmware-root/modules/vmnet-only/vm_atomic.h:2241:20: warning: typedef ‘AssertOnCompileFailed’ locally defined but not used [-Wunused-local-typedefs]
       typedef char AssertOnCompileFailed[AssertOnCompileMisused];             \
                    ^
/tmp/vmware-root/modules/vmnet-only/vm_atomic.h:2402:1: note: in expansion of macro ‘MAKE_ATOMIC_TYPE’
 MAKE_ATOMIC_TYPE(Ptr, 64, void const *, void *, uintptr_t)
 ^
/tmp/vmware-root/modules/vmnet-only/vm_atomic.h: In function ‘AtomicAssertOnCompileInt’:
/tmp/vmware-root/modules/vmnet-only/vm_atomic.h:2241:20: warning: typedef ‘AssertOnCompileFailed’ locally defined but not used [-Wunused-local-typedefs]
       typedef char AssertOnCompileFailed[AssertOnCompileMisused];             \
                    ^
/tmp/vmware-root/modules/vmnet-only/vm_atomic.h:2406:1: note: in expansion of macro ‘MAKE_ATOMIC_TYPE’
 MAKE_ATOMIC_TYPE(Int, 32, int, int, int)
 ^
In file included from /tmp/vmware-root/modules/vmnet-only/monitorAction_exported.h:31:0,
                 from /tmp/vmware-root/modules/vmnet-only/vnet.h:29,
                 from /tmp/vmware-root/modules/vmnet-only/vnetInt.h:24,
                 from /tmp/vmware-root/modules/vmnet-only/hub.c:43:
/tmp/vmware-root/modules/vmnet-only/monitorAction_exported.h: In function ‘MonitorActionSet_AtomicInclude’:
/tmp/vmware-root/modules/vmnet-only/vm_assert.h:274:20: warning: typedef ‘AssertOnCompileFailed’ locally defined but not used [-Wunused-local-typedefs]
       typedef char AssertOnCompileFailed[AssertOnCompileMisused]; \
                    ^
/tmp/vmware-root/modules/vmnet-only/monitorAction_exported.h:91:4: note: in expansion of macro ‘ASSERT_ON_COMPILE’
    ASSERT_ON_COMPILE((ACTION_WORD_SIZE & (ACTION_WORD_SIZE - 1)) == 0);
    ^
In file included from /tmp/vmware-root/modules/vmnet-only/vnet.h:28:0,
                 from /tmp/vmware-root/modules/vmnet-only/vnetInt.h:24,
                 from /tmp/vmware-root/modules/vmnet-only/vnetUserListener.c:39:
/tmp/vmware-root/modules/vmnet-only/vm_atomic.h: In function ‘AtomicAssertOnCompilePtr’:
/tmp/vmware-root/modules/vmnet-only/vm_atomic.h:2241:20: warning: typedef ‘AssertOnCompileFailed’ locally defined but not used [-Wunused-local-typedefs]
       typedef char AssertOnCompileFailed[AssertOnCompileMisused];             \
                    ^
/tmp/vmware-root/modules/vmnet-only/vm_atomic.h:2402:1: note: in expansion of macro ‘MAKE_ATOMIC_TYPE’
 MAKE_ATOMIC_TYPE(Ptr, 64, void const *, void *, uintptr_t)
 ^
/tmp/vmware-root/modules/vmnet-only/vm_atomic.h: In function ‘AtomicAssertOnCompileInt’:
/tmp/vmware-root/modules/vmnet-only/vm_atomic.h:2241:20: warning: typedef ‘AssertOnCompileFailed’ locally defined but not used [-Wunused-local-typedefs]
       typedef char AssertOnCompileFailed[AssertOnCompileMisused];             \
                    ^
/tmp/vmware-root/modules/vmnet-only/vm_atomic.h:2406:1: note: in expansion of macro ‘MAKE_ATOMIC_TYPE’
 MAKE_ATOMIC_TYPE(Int, 32, int, int, int)
 ^
In file included from /tmp/vmware-root/modules/vmnet-only/monitorAction_exported.h:31:0,
                 from /tmp/vmware-root/modules/vmnet-only/vnet.h:29,
                 from /tmp/vmware-root/modules/vmnet-only/vnetInt.h:24,
                 from /tmp/vmware-root/modules/vmnet-only/vnetUserListener.c:39:
/tmp/vmware-root/modules/vmnet-only/monitorAction_exported.h: In function ‘MonitorActionSet_AtomicInclude’:
/tmp/vmware-root/modules/vmnet-only/vm_assert.h:274:20: warning: typedef ‘AssertOnCompileFailed’ locally defined but not used [-Wunused-local-typedefs]
       typedef char AssertOnCompileFailed[AssertOnCompileMisused]; \
                    ^
/tmp/vmware-root/modules/vmnet-only/monitorAction_exported.h:91:4: note: in expansion of macro ‘ASSERT_ON_COMPILE’
    ASSERT_ON_COMPILE((ACTION_WORD_SIZE & (ACTION_WORD_SIZE - 1)) == 0);
    ^
/tmp/vmware-root/modules/vmnet-only/hub.c: In function ‘VNetHubFindHubByID’:
/tmp/vmware-root/modules/vmnet-only/hub.c:132:49: warning: argument to ‘sizeof’ in ‘memcmp’ call is the same expression as the first source; did you mean to provide an explicit length? [-Wsizeof-pointer-memaccess]
         memcmp(idNum, currHub->id.pvnID, sizeof idNum))) {
                                                 ^
/tmp/vmware-root/modules/vmnet-only/hub.c: In function ‘VNetHubAlloc’:
/tmp/vmware-root/modules/vmnet-only/hub.c:315:36: warning: argument to ‘sizeof’ in ‘memcpy’ call is the same pointer type ‘uint8 *’ as the destination; expected ‘uint8’ or an explicit length [-Wsizeof-pointer-memaccess]
   memcpy(hub->id.pvnID, id, sizeof id);
                                    ^
/tmp/vmware-root/modules/vmnet-only/hub.c:366:28: error: dereferencing pointer to incomplete type
             jack->procEntry->read_proc = VNetHubProcRead;
                            ^
/tmp/vmware-root/modules/vmnet-only/filter.c: At top level:
/tmp/vmware-root/modules/vmnet-only/filter.c:206:1: error: conflicting types for ‘VNetFilterHookFn’
 VNetFilterHookFn(unsigned int hooknum,                 // IN:
 ^
/tmp/vmware-root/modules/vmnet-only/filter.c:64:18: note: previous declaration of ‘VNetFilterHookFn’ was here
 static nf_hookfn VNetFilterHookFn;
                  ^
/tmp/vmware-root/modules/vmnet-only/hub.c:367:28: error: dereferencing pointer to incomplete type
             jack->procEntry->data = jack;
                            ^
In file included from /tmp/vmware-root/modules/vmnet-only/vnet.h:28:0,
                 from /tmp/vmware-root/modules/vmnet-only/vnetInt.h:24,
                 from /tmp/vmware-root/modules/vmnet-only/procfs.c:43:
/tmp/vmware-root/modules/vmnet-only/vm_atomic.h: In function ‘AtomicAssertOnCompilePtr’:
/tmp/vmware-root/modules/vmnet-only/vm_atomic.h:2241:20: warning: typedef ‘AssertOnCompileFailed’ locally defined but not used [-Wunused-local-typedefs]
       typedef char AssertOnCompileFailed[AssertOnCompileMisused];             \
                    ^
/tmp/vmware-root/modules/vmnet-only/vm_atomic.h:2402:1: note: in expansion of macro ‘MAKE_ATOMIC_TYPE’
 MAKE_ATOMIC_TYPE(Ptr, 64, void const *, void *, uintptr_t)
 ^
/tmp/vmware-root/modules/vmnet-only/vm_atomic.h: In function ‘AtomicAssertOnCompileInt’:
/tmp/vmware-root/modules/vmnet-only/vm_atomic.h:2241:20: warning: typedef ‘AssertOnCompileFailed’ locally defined but not used [-Wunused-local-typedefs]
       typedef char AssertOnCompileFailed[AssertOnCompileMisused];             \
                    ^
/tmp/vmware-root/modules/vmnet-only/vm_atomic.h:2406:1: note: in expansion of macro ‘MAKE_ATOMIC_TYPE’
 MAKE_ATOMIC_TYPE(Int, 32, int, int, int)
 ^
In file included from /tmp/vmware-root/modules/vmnet-only/vnet.h:28:0,
                 from /tmp/vmware-root/modules/vmnet-only/vnetInt.h:24,
                 from /tmp/vmware-root/modules/vmnet-only/netif.c:42:
/tmp/vmware-root/modules/vmnet-only/vm_atomic.h: In function ‘AtomicAssertOnCompilePtr’:
/tmp/vmware-root/modules/vmnet-only/vm_atomic.h:2241:20: warning: typedef ‘AssertOnCompileFailed’ locally defined but not used [-Wunused-local-typedefs]
       typedef char AssertOnCompileFailed[AssertOnCompileMisused];             \
                    ^
/tmp/vmware-root/modules/vmnet-only/vm_atomic.h:2402:1: note: in expansion of macro ‘MAKE_ATOMIC_TYPE’
 MAKE_ATOMIC_TYPE(Ptr, 64, void const *, void *, uintptr_t)
 ^
/tmp/vmware-root/modules/vmnet-only/vm_atomic.h: In function ‘AtomicAssertOnCompileInt’:
/tmp/vmware-root/modules/vmnet-only/vm_atomic.h:2241:20: warning: typedef ‘AssertOnCompileFailed’ locally defined but not used [-Wunused-local-typedefs]
       typedef char AssertOnCompileFailed[AssertOnCompileMisused];             \
                    ^
/tmp/vmware-root/modules/vmnet-only/vm_atomic.h:2406:1: note: in expansion of macro ‘MAKE_ATOMIC_TYPE’
 MAKE_ATOMIC_TYPE(Int, 32, int, int, int)
 ^
In file included from /tmp/vmware-root/modules/vmnet-only/monitorAction_exported.h:31:0,
                 from /tmp/vmware-root/modules/vmnet-only/vnet.h:29,
                 from /tmp/vmware-root/modules/vmnet-only/vnetInt.h:24,
                 from /tmp/vmware-root/modules/vmnet-only/netif.c:42:
/tmp/vmware-root/modules/vmnet-only/monitorAction_exported.h: In function ‘MonitorActionSet_AtomicInclude’:
/tmp/vmware-root/modules/vmnet-only/vm_assert.h:274:20: warning: typedef ‘AssertOnCompileFailed’ locally defined but not used [-Wunused-local-typedefs]
       typedef char AssertOnCompileFailed[AssertOnCompileMisused]; \
                    ^
/tmp/vmware-root/modules/vmnet-only/monitorAction_exported.h:91:4: note: in expansion of macro ‘ASSERT_ON_COMPILE’
    ASSERT_ON_COMPILE((ACTION_WORD_SIZE & (ACTION_WORD_SIZE - 1)) == 0);
    ^
In file included from /tmp/vmware-root/modules/vmnet-only/monitorAction_exported.h:31:0,
                 from /tmp/vmware-root/modules/vmnet-only/vnet.h:29,
                 from /tmp/vmware-root/modules/vmnet-only/vnetInt.h:24,
                 from /tmp/vmware-root/modules/vmnet-only/procfs.c:43:
/tmp/vmware-root/modules/vmnet-only/monitorAction_exported.h: In function ‘MonitorActionSet_AtomicInclude’:
/tmp/vmware-root/modules/vmnet-only/vm_assert.h:274:20: warning: typedef ‘AssertOnCompileFailed’ locally defined but not used [-Wunused-local-typedefs]
       typedef char AssertOnCompileFailed[AssertOnCompileMisused]; \
                    ^
/tmp/vmware-root/modules/vmnet-only/monitorAction_exported.h:91:4: note: in expansion of macro ‘ASSERT_ON_COMPILE’
    ASSERT_ON_COMPILE((ACTION_WORD_SIZE & (ACTION_WORD_SIZE - 1)) == 0);
    ^
In file included from /tmp/vmware-root/modules/vmnet-only/vnet.h:28:0,
                 from /tmp/vmware-root/modules/vmnet-only/vnetInt.h:24,
                 from /tmp/vmware-root/modules/vmnet-only/driver.c:51:
/tmp/vmware-root/modules/vmnet-only/vm_atomic.h: In function ‘AtomicAssertOnCompilePtr’:
/tmp/vmware-root/modules/vmnet-only/vm_atomic.h:2241:20: warning: typedef ‘AssertOnCompileFailed’ locally defined but not used [-Wunused-local-typedefs]
       typedef char AssertOnCompileFailed[AssertOnCompileMisused];             \
                    ^
/tmp/vmware-root/modules/vmnet-only/vm_atomic.h:2402:1: note: in expansion of macro ‘MAKE_ATOMIC_TYPE’
 MAKE_ATOMIC_TYPE(Ptr, 64, void const *, void *, uintptr_t)
 ^
/tmp/vmware-root/modules/vmnet-only/vm_atomic.h: In function ‘AtomicAssertOnCompileInt’:
/tmp/vmware-root/modules/vmnet-only/vm_atomic.h:2241:20: warning: typedef ‘AssertOnCompileFailed’ locally defined but not used [-Wunused-local-typedefs]
       typedef char AssertOnCompileFailed[AssertOnCompileMisused];             \
                    ^
/tmp/vmware-root/modules/vmnet-only/vm_atomic.h:2406:1: note: in expansion of macro ‘MAKE_ATOMIC_TYPE’
 MAKE_ATOMIC_TYPE(Int, 32, int, int, int)
 ^
/tmp/vmware-root/modules/vmnet-only/filter.c:64:18: warning: ‘VNetFilterHookFn’ used but never defined
/tmp/vmware-root/modules/vmnet-only/filter.c:206:1: warning: ‘VNetFilterHookFn’ defined but not used [-Wunused-function]
 VNetFilterHookFn(unsigned int hooknum,                 // IN:
 ^
In file included from /tmp/vmware-root/modules/vmnet-only/monitorAction_exported.h:31:0,
                 from /tmp/vmware-root/modules/vmnet-only/vnet.h:29,
                 from /tmp/vmware-root/modules/vmnet-only/vnetInt.h:24,
                 from /tmp/vmware-root/modules/vmnet-only/driver.c:51:
/tmp/vmware-root/modules/vmnet-only/monitorAction_exported.h: In function ‘MonitorActionSet_AtomicInclude’:
/tmp/vmware-root/modules/vmnet-only/vm_assert.h:274:20: warning: typedef ‘AssertOnCompileFailed’ locally defined but not used [-Wunused-local-typedefs]
       typedef char AssertOnCompileFailed[AssertOnCompileMisused]; \
                    ^
/tmp/vmware-root/modules/vmnet-only/monitorAction_exported.h:91:4: note: in expansion of macro ‘ASSERT_ON_COMPILE’
    ASSERT_ON_COMPILE((ACTION_WORD_SIZE & (ACTION_WORD_SIZE - 1)) == 0);
    ^
/tmp/vmware-root/modules/vmnet-only/procfs.c: In function ‘VNetProcMakeEntryInt’:
/tmp/vmware-root/modules/vmnet-only/procfs.c:125:4: error: implicit declaration of function ‘create_proc_entry’ [-Werror=implicit-function-declaration]
    ent = create_proc_entry(name, mode, parent);
    ^
/tmp/vmware-root/modules/vmnet-only/procfs.c:125:8: warning: assignment makes pointer from integer without a cast
    ent = create_proc_entry(name, mode, parent);
        ^
/tmp/vmware-root/modules/vmnet-only/procfs.c: In function ‘VNetProcRemoveEntryInt’:
/tmp/vmware-root/modules/vmnet-only/procfs.c:154:29: error: dereferencing pointer to incomplete type
       remove_proc_entry(node->name, parent);
                             ^
/tmp/vmware-root/modules/vmnet-only/netif.c: In function ‘VNetNetIf_Create’:
/tmp/vmware-root/modules/vmnet-only/netif.c:215:33: error: dereferencing pointer to incomplete type
       netIf->port.jack.procEntry->read_proc = VNetNetIfProcRead;
                                 ^
/tmp/vmware-root/modules/vmnet-only/netif.c:216:33: error: dereferencing pointer to incomplete type
       netIf->port.jack.procEntry->data = netIf;
                                 ^
/tmp/vmware-root/modules/vmnet-only/netif.c:248:81: error: macro "alloc_netdev" requires 4 arguments, but only 3 given
    dev = compat_alloc_netdev(sizeof(VNetNetIF *), netIf->devName, VNetNetIfSetup);
                                                                                 ^
In file included from /tmp/vmware-root/modules/vmnet-only/netif.c:43:0:
/tmp/vmware-root/modules/vmnet-only/compat_netdevice.h:170:51: error: ‘alloc_netdev’ undeclared (first use in this function)
 #   define compat_alloc_netdev(size, mask, setup) alloc_netdev(size, mask, setup)
                                                   ^
/tmp/vmware-root/modules/vmnet-only/netif.c:248:10: note: in expansion of macro ‘compat_alloc_netdev’
    dev = compat_alloc_netdev(sizeof(VNetNetIF *), netIf->devName, VNetNetIfSetup);
          ^
/tmp/vmware-root/modules/vmnet-only/compat_netdevice.h:170:51: note: each undeclared identifier is reported only once for each function it appears in
 #   define compat_alloc_netdev(size, mask, setup) alloc_netdev(size, mask, setup)
                                                   ^
/tmp/vmware-root/modules/vmnet-only/netif.c:248:10: note: in expansion of macro ‘compat_alloc_netdev’
    dev = compat_alloc_netdev(sizeof(VNetNetIF *), netIf->devName, VNetNetIfSetup);
          ^
scripts/Makefile.build:257: set di istruzioni per l'obiettivo "/tmp/vmware-root/modules/vmnet-only/hub.o" non riuscito
make[2]: *** [/tmp/vmware-root/modules/vmnet-only/hub.o] Errore 1
make[2]: *** Attesa per i processi non terminati....
/tmp/vmware-root/modules/vmnet-only/netif.c: At top level:
/tmp/vmware-root/modules/vmnet-only/netif.c:86:1: warning: ‘VNetNetIfSetup’ defined but not used [-Wunused-function]
 VNetNetIfSetup(struct net_device *dev)  // IN:
 ^
In file included from /tmp/vmware-root/modules/vmnet-only/vnet.h:28:0,
                 from /tmp/vmware-root/modules/vmnet-only/vnetInt.h:24,
                 from /tmp/vmware-root/modules/vmnet-only/userif.c:45:
/tmp/vmware-root/modules/vmnet-only/vm_atomic.h: In function ‘AtomicAssertOnCompilePtr’:
/tmp/vmware-root/modules/vmnet-only/vm_atomic.h:2241:20: warning: typedef ‘AssertOnCompileFailed’ locally defined but not used [-Wunused-local-typedefs]
       typedef char AssertOnCompileFailed[AssertOnCompileMisused];             \
                    ^
/tmp/vmware-root/modules/vmnet-only/vm_atomic.h:2402:1: note: in expansion of macro ‘MAKE_ATOMIC_TYPE’
 MAKE_ATOMIC_TYPE(Ptr, 64, void const *, void *, uintptr_t)
 ^
/tmp/vmware-root/modules/vmnet-only/vm_atomic.h: In function ‘AtomicAssertOnCompileInt’:
/tmp/vmware-root/modules/vmnet-only/vm_atomic.h:2241:20: warning: typedef ‘AssertOnCompileFailed’ locally defined but not used [-Wunused-local-typedefs]
       typedef char AssertOnCompileFailed[AssertOnCompileMisused];             \
                    ^
/tmp/vmware-root/modules/vmnet-only/vm_atomic.h:2406:1: note: in expansion of macro ‘MAKE_ATOMIC_TYPE’
 MAKE_ATOMIC_TYPE(Int, 32, int, int, int)
 ^
cc1: some warnings being treated as errors
scripts/Makefile.build:257: set di istruzioni per l'obiettivo "/tmp/vmware-root/modules/vmnet-only/procfs.o" non riuscito
make[2]: *** [/tmp/vmware-root/modules/vmnet-only/procfs.o] Errore 1
/tmp/vmware-root/modules/vmnet-only/driver.c: In function ‘VNetFileOpUnlockedIoctl’:
In file included from /tmp/vmware-root/modules/vmnet-only/monitorAction_exported.h:31:0,
                 from /tmp/vmware-root/modules/vmnet-only/vnet.h:29,
                 from /tmp/vmware-root/modules/vmnet-only/vnetInt.h:24,
                 from /tmp/vmware-root/modules/vmnet-only/userif.c:45:
/tmp/vmware-root/modules/vmnet-only/monitorAction_exported.h: In function ‘MonitorActionSet_AtomicInclude’:
/tmp/vmware-root/modules/vmnet-only/vm_assert.h:274:20: warning: typedef ‘AssertOnCompileFailed’ locally defined but not used [-Wunused-local-typedefs]
       typedef char AssertOnCompileFailed[AssertOnCompileMisused]; \
                    ^
/tmp/vmware-root/modules/vmnet-only/monitorAction_exported.h:91:4: note: in expansion of macro ‘ASSERT_ON_COMPILE’
    ASSERT_ON_COMPILE((ACTION_WORD_SIZE & (ACTION_WORD_SIZE - 1)) == 0);
    ^
scripts/Makefile.build:257: set di istruzioni per l'obiettivo "/tmp/vmware-root/modules/vmnet-only/filter.o" non riuscito
make[2]: *** [/tmp/vmware-root/modules/vmnet-only/filter.o] Errore 1
/tmp/vmware-root/modules/vmnet-only/driver.c:1228:20: error: ‘struct file’ has no member named ‘f_dentry’
    if (filp && filp->f_dentry) {
                    ^
/tmp/vmware-root/modules/vmnet-only/driver.c:1229:19: error: ‘struct file’ has no member named ‘f_dentry’
       inode = filp->f_dentry->d_inode;
                   ^
scripts/Makefile.build:257: set di istruzioni per l'obiettivo "/tmp/vmware-root/modules/vmnet-only/netif.o" non riuscito
make[2]: *** [/tmp/vmware-root/modules/vmnet-only/netif.o] Errore 1
/tmp/vmware-root/modules/vmnet-only/userif.c: In function ‘VNetCopyDatagram’:
/tmp/vmware-root/modules/vmnet-only/userif.c:469:4: error: implicit declaration of function ‘skb_copy_datagram_iovec’ [-Werror=implicit-function-declaration]
    return skb_copy_datagram_iovec(skb, 0, &iov, len);
    ^
In file included from /tmp/vmware-root/modules/vmnet-only/monitorAction_exported.h:31:0,
                 from /tmp/vmware-root/modules/vmnet-only/vnet.h:29,
                 from /tmp/vmware-root/modules/vmnet-only/vnetInt.h:24,
                 from /tmp/vmware-root/modules/vmnet-only/userif.c:45:
/tmp/vmware-root/modules/vmnet-only/userif.c: In function ‘VNetUserIfIoctl’:
/tmp/vmware-root/modules/vmnet-only/vm_assert.h:274:20: warning: typedef ‘AssertOnCompileFailed’ locally defined but not used [-Wunused-local-typedefs]
       typedef char AssertOnCompileFailed[AssertOnCompileMisused]; \
                    ^
/tmp/vmware-root/modules/vmnet-only/userif.c:808:7: note: in expansion of macro ‘ASSERT_ON_COMPILE’
       ASSERT_ON_COMPILE(VNET_NOTIFY_VERSION == 5);
       ^
/tmp/vmware-root/modules/vmnet-only/vm_assert.h:274:20: warning: typedef ‘AssertOnCompileFailed’ locally defined but not used [-Wunused-local-typedefs]
       typedef char AssertOnCompileFailed[AssertOnCompileMisused]; \
                    ^
/tmp/vmware-root/modules/vmnet-only/userif.c:809:7: note: in expansion of macro ‘ASSERT_ON_COMPILE’
       ASSERT_ON_COMPILE(ACTION_EXPORTED_VERSION == 2);
       ^
/tmp/vmware-root/modules/vmnet-only/userif.c: In function ‘VNetUserIf_Create’:
/tmp/vmware-root/modules/vmnet-only/userif.c:1047:34: error: dereferencing pointer to incomplete type
       userIf->port.jack.procEntry->read_proc = VNetUserIfProcRead;
                                  ^
/tmp/vmware-root/modules/vmnet-only/userif.c:1048:34: error: dereferencing pointer to incomplete type
       userIf->port.jack.procEntry->data = userIf;
                                  ^
scripts/Makefile.build:257: set di istruzioni per l'obiettivo "/tmp/vmware-root/modules/vmnet-only/driver.o" non riuscito
make[2]: *** [/tmp/vmware-root/modules/vmnet-only/driver.o] Errore 1
cc1: some warnings being treated as errors
scripts/Makefile.build:257: set di istruzioni per l'obiettivo "/tmp/vmware-root/modules/vmnet-only/userif.o" non riuscito
make[2]: *** [/tmp/vmware-root/modules/vmnet-only/userif.o] Errore 1
In file included from /tmp/vmware-root/modules/vmnet-only/vnet.h:28:0,
                 from /tmp/vmware-root/modules/vmnet-only/vnetInt.h:24,
                 from /tmp/vmware-root/modules/vmnet-only/bridge.c:52:
/tmp/vmware-root/modules/vmnet-only/vm_atomic.h: In function ‘AtomicAssertOnCompilePtr’:
/tmp/vmware-root/modules/vmnet-only/vm_atomic.h:2241:20: warning: typedef ‘AssertOnCompileFailed’ locally defined but not used [-Wunused-local-typedefs]
       typedef char AssertOnCompileFailed[AssertOnCompileMisused];             \
                    ^
/tmp/vmware-root/modules/vmnet-only/vm_atomic.h:2402:1: note: in expansion of macro ‘MAKE_ATOMIC_TYPE’
 MAKE_ATOMIC_TYPE(Ptr, 64, void const *, void *, uintptr_t)
 ^
/tmp/vmware-root/modules/vmnet-only/vm_atomic.h: In function ‘AtomicAssertOnCompileInt’:
/tmp/vmware-root/modules/vmnet-only/vm_atomic.h:2241:20: warning: typedef ‘AssertOnCompileFailed’ locally defined but not used [-Wunused-local-typedefs]
       typedef char AssertOnCompileFailed[AssertOnCompileMisused];             \
                    ^
/tmp/vmware-root/modules/vmnet-only/vm_atomic.h:2406:1: note: in expansion of macro ‘MAKE_ATOMIC_TYPE’
 MAKE_ATOMIC_TYPE(Int, 32, int, int, int)
 ^
In file included from /tmp/vmware-root/modules/vmnet-only/monitorAction_exported.h:31:0,
                 from /tmp/vmware-root/modules/vmnet-only/vnet.h:29,
                 from /tmp/vmware-root/modules/vmnet-only/vnetInt.h:24,
                 from /tmp/vmware-root/modules/vmnet-only/bridge.c:52:
/tmp/vmware-root/modules/vmnet-only/monitorAction_exported.h: In function ‘MonitorActionSet_AtomicInclude’:
/tmp/vmware-root/modules/vmnet-only/vm_assert.h:274:20: warning: typedef ‘AssertOnCompileFailed’ locally defined but not used [-Wunused-local-typedefs]
       typedef char AssertOnCompileFailed[AssertOnCompileMisused]; \
                    ^
/tmp/vmware-root/modules/vmnet-only/monitorAction_exported.h:91:4: note: in expansion of macro ‘ASSERT_ON_COMPILE’
    ASSERT_ON_COMPILE((ACTION_WORD_SIZE & (ACTION_WORD_SIZE - 1)) == 0);
    ^
/tmp/vmware-root/modules/vmnet-only/bridge.c: In function ‘VNetBridge_Create’:
/tmp/vmware-root/modules/vmnet-only/bridge.c:331:34: error: dereferencing pointer to incomplete type
       bridge->port.jack.procEntry->read_proc = VNetBridgeProcRead;
                                  ^
/tmp/vmware-root/modules/vmnet-only/bridge.c:332:34: error: dereferencing pointer to incomplete type
       bridge->port.jack.procEntry->data = bridge;
                                  ^
scripts/Makefile.build:257: set di istruzioni per l'obiettivo "/tmp/vmware-root/modules/vmnet-only/bridge.o" non riuscito
make[2]: *** [/tmp/vmware-root/modules/vmnet-only/bridge.o] Errore 1
Makefile:1382: set di istruzioni per l'obiettivo "_module_/tmp/vmware-root/modules/vmnet-only" non riuscito
make[1]: *** [_module_/tmp/vmware-root/modules/vmnet-only] Errore 2
make[1]: uscita dalla directory "/usr/lib/modules/3.19.2-1-ARCH/build"
Makefile:126: set di istruzioni per l'obiettivo "vmnet.ko" non riuscito
make: *** [vmnet.ko] Errore 2
make: uscita dalla directory "/tmp/vmware-root/modules/vmnet-only"
Unable to install vmnet
[jacopo@archlaptop ~]$


Ci tengo a precisare che ho seguito la guida della wiki passo passo
Put the fun back into computing.

Arch 64bit con Cinnamon/Xfce4.12 su ASUS X52JB (Intel Pentium P6100, 4Gb RAM e ATI Mobility Radeon HD 5145)
Arch 64bit con Cinnamon (Intel Core i5-4690K e Asus nVidia GTX-970 Strix Direct CU II OC)

JacopoMolteni
Arciere
Messaggi: 226
Iscritto il: 11 febbraio 2015, 16:53
Architettura: x86_64 (64bit)

Re: Problema installazione moduli VMware

Messaggio da JacopoMolteni » 26 marzo 2015, 23:21

Nessuna idea?
Put the fun back into computing.

Arch 64bit con Cinnamon/Xfce4.12 su ASUS X52JB (Intel Pentium P6100, 4Gb RAM e ATI Mobility Radeon HD 5145)
Arch 64bit con Cinnamon (Intel Core i5-4690K e Asus nVidia GTX-970 Strix Direct CU II OC)

JacopoMolteni
Arciere
Messaggi: 226
Iscritto il: 11 febbraio 2015, 16:53
Architettura: x86_64 (64bit)

Re: Problema installazione moduli VMware

Messaggio da JacopoMolteni » 7 aprile 2015, 19:47

Immagine
Put the fun back into computing.

Arch 64bit con Cinnamon/Xfce4.12 su ASUS X52JB (Intel Pentium P6100, 4Gb RAM e ATI Mobility Radeon HD 5145)
Arch 64bit con Cinnamon (Intel Core i5-4690K e Asus nVidia GTX-970 Strix Direct CU II OC)

Rispondi